Target
Prolyl endopeptidase
Ligand
BDBM50135634
Substrate
Meas. Tech.
ChEMBL_157490 (CHEMBL765807)
Ki
0.450000±n/a nM
Citation
 Bal, GVan der Veken, PAntonov, DLambeir, AMGrellier, PCroft, SLAugustyns, KHaemers, A Prolylisoxazoles: potent inhibitors of prolyloligopeptidase with antitrypanosomal activity. Bioorg Med Chem Lett 13:2875-8 (2003)  
Target
Name:
Prolyl endopeptidase
Synonyms:
PE POP PREP Prolyl oligopeptidase
Type:
Enzyme
Mol. Mass.:
80688.50
Organism:
Homo sapiens (Human)
Description:
P48147
Residue:
710
  
Inhibitor
Name:
BDBM50135634
Synonyms:
(S)-2-[(S)-2-(5-Trimethylsilanyl-isoxazole-3-carbonyl)-pyrrolidine-1-carbonyl]-pyrrolidine-1-carboxylic acid benzyl ester | CHEMBL99305
Type:
Small organic molecule
Emp. Form.:
C24H31N3O5Si
Mol. Mass.:
469.6055
SMILES:
C[Si](C)(C)c1cc(no1)C(=O)[C@@H]1CCCN1C(=O)[C@@H]1CCCN1C(=O)OCc1ccccc1
: