Target
Serine/threonine-protein phosphatase 2A catalytic subunit alpha isoform
Ligand
BDBM50135693
Substrate
Meas. Tech.
ChEMBL_161787 (CHEMBL768161)
IC50
>100000±n/a nM
Citation
 Gulledge, BMAggen, JBEng, HSweimeh, KChamberlin, AR Microcystin analogues comprised only of Adda and a single additional amino acid retain moderate activity as PP1/PP2A inhibitors. Bioorg Med Chem Lett 13:2907-11 (2003)  
Target
Name:
Serine/threonine-protein phosphatase 2A catalytic subunit alpha isoform
Synonyms:
PP2AA_BOVIN Serine/threonine protein phosphatase 2A, catalytic subunit, alpha isoform
Type:
PROTEIN
Mol. Mass.:
35586.74
Organism:
Bos taurus
Description:
ChEMBL_161787
Residue:
309
  
Inhibitor
Name:
BDBM50135693
Synonyms:
(2R,4S)-1-((4E,6E)-(2S,3S,8S,9S)-3-Acetylamino-9-methoxy-2,6,8-trimethyl-10-phenyl-deca-4,6-dienoyl)-pyrrolidine-2,4-dicarboxylic acid | CHEMBL97984
Type:
Small organic molecule
Emp. Form.:
C28H38N2O7
Mol. Mass.:
514.6105
SMILES:
CO[C@@H](Cc1ccccc1)[C@@H](C)\C=C(/C)\C=C\[C@H](NC(C)=O)[C@H](C)C(=O)N1C[C@H](C[C@@H]1C(O)=O)C(O)=O
: