Target
Liver carboxylesterase
Ligand
BDBM50570553
Substrate
Meas. Tech.
ChEMBL_2112549 (CHEMBL4821399)
IC50
5.0±n/a nM
Citation
 Makhaeva, GFLushchekina, SVBoltneva, NPSerebryakova, OGKovaleva, NVRudakova, EVElkina, NAShchegolkov, EVBurgart, YVStupina, TSTerentiev, AARadchenko, EVPalyulin, VASaloutin, VIBachurin, SORichardson, RJ Novel potent bifunctional carboxylesterase inhibitors based on a polyfluoroalkyl-2-imino-1,3-dione scaffold. Eur J Med Chem 218:0 (2021)  
Target
Name:
Liver carboxylesterase
Synonyms:
Carboxylesterase | EST1_PIG
Type:
PROTEIN
Mol. Mass.:
62009.98
Organism:
Sus scrofa
Description:
ChEMBL_427761
Residue:
566
  
Inhibitor
Name:
BDBM50570553
Synonyms:
CHEMBL4854298
Type:
Small organic molecule
Emp. Form.:
C12H10F3N3O5
Mol. Mass.:
333.2201
SMILES:
CCOC(=O)C(=N/Nc1ccccc1[N+]([O-])=O)\C(=O)C(F)(F)F
: