Target
Liver carboxylesterase
Ligand
BDBM50570566
Substrate
Meas. Tech.
ChEMBL_2112549 (CHEMBL4821399)
IC50
103±n/a nM
Citation
 Makhaeva, GFLushchekina, SVBoltneva, NPSerebryakova, OGKovaleva, NVRudakova, EVElkina, NAShchegolkov, EVBurgart, YVStupina, TSTerentiev, AARadchenko, EVPalyulin, VASaloutin, VIBachurin, SORichardson, RJ Novel potent bifunctional carboxylesterase inhibitors based on a polyfluoroalkyl-2-imino-1,3-dione scaffold. Eur J Med Chem 218:0 (2021)  
Target
Name:
Liver carboxylesterase
Synonyms:
Carboxylesterase | EST1_PIG
Type:
PROTEIN
Mol. Mass.:
62009.98
Organism:
Sus scrofa
Description:
ChEMBL_427761
Residue:
566
  
Inhibitor
Name:
BDBM50570566
Synonyms:
CHEMBL4849604
Type:
Small organic molecule
Emp. Form.:
C14H11F7N2O4
Mol. Mass.:
404.237
SMILES:
COC(=O)C(=N/Nc1ccc(OC)cc1)\C(=O)C(F)(F)C(F)(F)C(F)(F)F
: