Target
Acetylcholinesterase
Ligand
BDBM50570559
Substrate
Meas. Tech.
ChEMBL_2112560 (CHEMBL4821410)
Ki
10100±n/a nM
Citation
 Makhaeva, GFLushchekina, SVBoltneva, NPSerebryakova, OGKovaleva, NVRudakova, EVElkina, NAShchegolkov, EVBurgart, YVStupina, TSTerentiev, AARadchenko, EVPalyulin, VASaloutin, VIBachurin, SORichardson, RJ Novel potent bifunctional carboxylesterase inhibitors based on a polyfluoroalkyl-2-imino-1,3-dione scaffold. Eur J Med Chem 218:0 (2021)  
Target
Name:
Acetylcholinesterase
Synonyms:
ACES_HUMAN Acetylcholinesterase (AChE) | Acetylcholinesterase (human AChE)
Type:
Enzyme
Mol. Mass.:
67792.70
Organism:
Homo sapiens (Human)
Description:
P22303
Residue:
614
  
Inhibitor
Name:
BDBM50570559
Synonyms:
CHEMBL4868687
Type:
Small organic molecule
Emp. Form.:
C12H11F3N2O3
Mol. Mass.:
288.2225
SMILES:
COC(=O)C(=N/Nc1ccc(C)cc1)\C(=O)C(F)(F)F
: