Target
Liver carboxylesterase 1
Ligand
BDBM50570564
Substrate
Meas. Tech.
ChEMBL_2112564 (CHEMBL4821414)
IC50
47±n/a nM
Citation
 Makhaeva, GFLushchekina, SVBoltneva, NPSerebryakova, OGKovaleva, NVRudakova, EVElkina, NAShchegolkov, EVBurgart, YVStupina, TSTerentiev, AARadchenko, EVPalyulin, VASaloutin, VIBachurin, SORichardson, RJ Novel potent bifunctional carboxylesterase inhibitors based on a polyfluoroalkyl-2-imino-1,3-dione scaffold. Eur J Med Chem 218:0 (2021)  
Target
Name:
Liver carboxylesterase 1
Synonyms:
Acyl coenzyme A:cholesterol acyltransferase CES1 EST1_HUMAN Serine hydrolase (CES1)
Type:
Protein
Mol. Mass.:
62520.83
Organism:
Homo sapiens (Human)
Description:
Residue:
567
  
Inhibitor
Name:
BDBM50570564
Synonyms:
CHEMBL4853013
Type:
Small organic molecule
Emp. Form.:
C14H13F5N2O3
Mol. Mass.:
352.2566
SMILES:
CCOC(=O)C(=N/Nc1ccc(C)cc1)\C(=O)C(F)(F)C(F)(F)F
: