Target
Cocaine esterase
Ligand
BDBM50570555
Substrate
Meas. Tech.
ChEMBL_2112565 (CHEMBL4821415)
IC50
11±n/a nM
Citation
 Makhaeva, GFLushchekina, SVBoltneva, NPSerebryakova, OGKovaleva, NVRudakova, EVElkina, NAShchegolkov, EVBurgart, YVStupina, TSTerentiev, AARadchenko, EVPalyulin, VASaloutin, VIBachurin, SORichardson, RJ Novel potent bifunctional carboxylesterase inhibitors based on a polyfluoroalkyl-2-imino-1,3-dione scaffold. Eur J Med Chem 218:0 (2021)  
Target
Name:
Cocaine esterase
Synonyms:
CES2 EST2_HUMAN | ICE
Type:
PROTEIN
Mol. Mass.:
61801.08
Organism:
Homo sapiens (Human)
Description:
ChEMBL_1494240
Residue:
559
  
Inhibitor
Name:
BDBM50570555
Synonyms:
CHEMBL4868014
Type:
Small organic molecule
Emp. Form.:
C12H10BrF3N2O3
Mol. Mass.:
367.119
SMILES:
CCOC(=O)C(=N/Nc1ccc(Br)cc1)\C(=O)C(F)(F)F
: