Target
Cannabinoid receptor 1
Ligand
BDBM22988
Substrate
Meas. Tech.
ChEMBL_46446 (CHEMBL657894)
Ki
300±n/a nM
Citation
 McAllister, SDRizvi, GAnavi-Goffer, SHurst, DPBarnett-Norris, JLynch, DLReggio, PHAbood, ME An aromatic microdomain at the cannabinoid CB(1) receptor constitutes an agonist/inverse agonist binding region. J Med Chem 46:5139-52 (2003)  
Target
Name:
Cannabinoid receptor 1
Synonyms:
CANN6 CB-R CNR CNR1_HUMAN Cannabinoid receptor Cannabinoid receptor 1 (brain)
Type:
G Protein-Coupled Receptor (GPCR)
Mol. Mass.:
52868.96
Organism:
Homo sapiens (Human)
Description:
P21554
Residue:
472
  
Inhibitor
Name:
BDBM22988
Synonyms:
(5Z,8Z,11Z,14Z)-N-(2-hydroxyethyl)icosa-5,8,11,14-tetraenamide ANANDAMIDE Arachidonoyl ethanolamide (AEA) Arachidonylethanolamide [14C]Anandamide | [3H]Anandamide
Type:
radiolabeled substrate
Emp. Form.:
C22H37NO2
Mol. Mass.:
347.5347
SMILES:
CCCCC\C=C/C\C=C/C\C=C/C\C=C/CCCC(=O)NCCO
: