Target
Farnesyl pyrophosphate synthase
Ligand
BDBM12581
Substrate
Meas. Tech.
ChEMBL_69841 (CHEMBL857167)
IC50
1862±n/a nM
Citation
 Sanders, JMGómez, AOMao, JMeints, GAVan Brussel, EMBurzynska, AKafarski, PGonzález-Pacanowska, DOldfield, E 3-D QSAR investigations of the inhibition of Leishmania major farnesyl pyrophosphate synthase by bisphosphonates. J Med Chem 46:5171-83 (2003)  
Target
Name:
Farnesyl pyrophosphate synthase
Synonyms:
Dimethylallyltranstransferase FPP synthase FPPS_HUMAN Farnesyl diphosphate synthase Farnesyl diphosphate synthetase Farnesyl pyrophosphate synthetase KIAA1293 | P14324
Type:
Enzyme
Mol. Mass.:
48272.89
Organism:
Homo sapiens (Human)
Description:
P14324
Residue:
419
  
Inhibitor
Name:
BDBM12581
Synonyms:
(3-amino-1-hydroxy-1-phosphonopropyl)phosphonic acid CHEMBL834 | JMC515594 Compound 62
Type:
Small organic molecule
Emp. Form.:
C3H11NO7P2
Mol. Mass.:
235.0695
SMILES:
NCCC(O)(P(O)(O)=O)P(O)(O)=O
: