Target
Adenosine kinase
Ligand
BDBM50135902
Substrate
Meas. Tech.
ChEMBL_31127 (CHEMBL643555)
IC50
63±n/a nM
Citation
 Perner, RJGu, YGLee, CHBayburt, EKMcKie, JAlexander, KMKohlhaas, KLWismer, CTMikusa, JJarvis, MFKowaluk, EABhagwat, SS 5,6,7-trisubstituted 4-aminopyrido[2,3-d]pyrimidines as novel inhibitors of adenosine kinase. J Med Chem 46:5249-57 (2003)  
Target
Name:
Adenosine kinase
Synonyms:
ADENOSINE Adenosine 5-phosphotransferase Adenosine kinase | Adk
Type:
Enzyme
Mol. Mass.:
40130.14
Organism:
Rattus norvegicus (rat)
Description:
Rat brain cytosol as enzyme source.
Residue:
361
  
Inhibitor
Name:
BDBM50135902
Synonyms:
6-Benzyl-5-(3-bromo-phenyl)-7-(6-morpholin-4-yl-pyridin-3-yl)-pyrido[2,3-d]pyrimidin-4-ylamine | CHEMBL439635
Type:
Small organic molecule
Emp. Form.:
C29H25BrN6O
Mol. Mass.:
553.452
SMILES:
Nc1ncnc2nc(-c3ccc(nc3)N3CCOCC3)c(Cc3ccccc3)c(-c3cccc(Br)c3)c12
: