Target
Cytochrome P450 2C9
Ligand
BDBM50136044
Substrate
Meas. Tech.
ChEMBL_51532 (CHEMBL660392)
IC50
17800±n/a nM
Citation
 Nakamura, TSato, MKakinuma, HMiyata, NTaniguchi, KBando, KKoda, AKameo, K Pyrazole and isoxazole derivatives as new, potent, and selective 20-hydroxy-5,8,11,14-eicosatetraenoic acid synthase inhibitors. J Med Chem 46:5416-27 (2003)  
Target
Name:
Cytochrome P450 2C9
Synonyms:
(R)-limonene 6-monooxygenase CP2C9_HUMAN CYP2C9 Cytochrome P450 2C9 (CYP2C9 ) P-450MP P450 PB-1 | S-mephenytoin 4-hydroxylase
Type:
Enzyme
Mol. Mass.:
55636.33
Organism:
Homo sapiens (Human)
Description:
P11712
Residue:
490
  
Inhibitor
Name:
BDBM50136044
Synonyms:
5-(4-Butoxy-phenyl)-3-methyl-1H-pyrazole | CHEMBL356594
Type:
Small organic molecule
Emp. Form.:
C14H18N2O
Mol. Mass.:
230.3055
SMILES:
CCCCOc1ccc(cc1)-c1cc(C)[nH]n1
: