Target
Tyrosine-protein kinase Fgr
Ligand
BDBM50571039
Substrate
Meas. Tech.
ChEMBL_2113640 (CHEMBL4822490)
IC50
5.4±n/a nM
Citation
 Qiu, HAli, ZBender, ACaldwell, RChen, YYFang, ZGardberg, AGlaser, NGoettsche, AGoutopoulos, AGrenningloh, RHanschke, BHead, JJohnson, TJones, CJones, RKulkarni, SMaurer, CMorandi, FNeagu, CPoetzsch, SPotnick, JSchmidt, RRoe, KViacava Follis, AWing, CZhu, XSherer, B Discovery of potent and selective reversible Bruton's tyrosine kinase inhibitors. Bioorg Med Chem 40:0 (2021)  
Target
Name:
Tyrosine-protein kinase Fgr
Synonyms:
FGR Gardner-Rasheed feline sarcoma viral (v-fgr) oncogene homolog SRC p55-Fgr p58c-Fgr
Type:
protein
Mol. Mass.:
59469.88
Organism:
Homo sapiens (Human)
Description:
P09769
Residue:
529
  
Inhibitor
Name:
BDBM50571039
Synonyms:
CHEMBL4877846
Type:
Small organic molecule
Emp. Form.:
C32H38N8O2
Mol. Mass.:
566.6965
SMILES:
CC(C)n1nc(C)c(c1C)-c1nc2c(ccnc2[nH]1)-c1ccc2[C@@H](CCCCc2c1)NC(=O)c1nc(no1)C(C)(C)C
: