Target
Calcium/calmodulin-dependent protein kinase type 1
Ligand
BDBM50571440
Substrate
Meas. Tech.
ChEMBL_2114685 (CHEMBL4823626)
IC50
>1000±n/a nM
Citation
 Zhang, HPeng, XDai, YShao, JJi, YSun, YLiu, BCheng, XAi, JDuan, W Discovery of a Pyrimidinedione Derivative as a Potent and Orally Bioavailable Axl Inhibitor. J Med Chem 64:3956-3975 (2021)  
Target
Name:
Calcium/calmodulin-dependent protein kinase type 1
Synonyms:
CAMK1 CaM kinase I alpha CaMKI-alpha KCC1A_HUMAN
Type:
PROTEIN
Mol. Mass.:
41325.04
Organism:
Homo sapiens (Human)
Description:
ChEMBL_655701
Residue:
370
  
Inhibitor
Name:
BDBM50571440
Synonyms:
CHEMBL4873571
Type:
Small organic molecule
Emp. Form.:
C29H25F2N5O5
Mol. Mass.:
561.5361
SMILES:
CC(C)n1cc(C(=O)Nc2ccc(Oc3ccnc(NC(=O)C4CC4)c3)c(F)c2)c(=O)n(-c2ccc(F)cc2)c1=O
: