Target
Transient receptor potential cation channel subfamily M member 5
Ligand
BDBM50571641
Substrate
Meas. Tech.
ChEMBL_2115164 (CHEMBL4824105)
EC50
309±n/a nM
Citation
 Barilli, AAldegheri, LBianchi, FBrault, LBrodbeck, DCastelletti, LFeriani, ALingard, IMyers, RNola, SPiccoli, LPompilio, DRaveglia, LFSalvagno, CTassini, SVirginio, CSabat, M From High-Throughput Screening to Target Validation: Benzo[ J Med Chem 64:5931-5955 (2021)  
Target
Name:
Transient receptor potential cation channel subfamily M member 5
Synonyms:
LTRPC5 LTrpC-5 MLSN1- and TRP-related gene 1 protein TRPM5 Transient receptor potential cation channel subfamily M member 5
Type:
PROTEIN
Mol. Mass.:
131454.24
Organism:
Homo sapiens (Human)
Description:
ChEMBL_103787
Residue:
1165
  
Inhibitor
Name:
BDBM50571641
Synonyms:
CHEMBL4849376
Type:
Small organic molecule
Emp. Form.:
C13H12Cl2N4S
Mol. Mass.:
327.232
SMILES:
CN(Cc1ncc(Cl)n1C)c1cc2sncc2cc1Cl
: