Target
Calmodulin-sensitive adenylate cyclase
Ligand
BDBM50479983
Substrate
Meas. Tech.
ChEMBL_2115462 (CHEMBL4824403)
IC50
36±n/a nM
Citation
 B?ehová, PChaloupecká, E?esnek, MSkácel, JDra?ínský, MTlou??ová, EMertlíková-Kaiserová, HSoto-Velasquez, MPWatts, VJJaneba, Z Acyclic nucleoside phosphonates with 2-aminothiazole base as inhibitors of bacterial and mammalian adenylate cyclases. Eur J Med Chem 222:0 (2021)  
Target
Name:
Calmodulin-sensitive adenylate cyclase
Synonyms:
CYAA_BACAN | cya
Type:
PROTEIN
Mol. Mass.:
92481.33
Organism:
Bacillus anthracis
Description:
ChEMBL_606615
Residue:
800
  
Inhibitor
Name:
BDBM50479983
Synonyms:
Adefovir Diphosphate
Type:
Small organic molecule
Emp. Form.:
C8H14N5O10P3
Mol. Mass.:
433.1455
SMILES:
Nc1ncnc2n(CCOCP(O)(=O)OP(O)(=O)OP(O)(O)=O)cnc12
: