Target
Matrix metalloproteinase-26
Ligand
BDBM50137277
Substrate
Meas. Tech.
ChEBML_104566
IC50
492±n/a nM
Citation
 Ma, DWu, WYang, GLi, JLi, JYe, Q Tetrahydroisoquinoline based sulfonamide hydroxamates as potent matrix metalloproteinase inhibitors. Bioorg Med Chem Lett 14:47-50 (2003)  
Target
Name:
Matrix metalloproteinase-26
Synonyms:
Endometase MMP26 Matrilysin-2 Matrix metalloproteinase-26
Type:
PROTEIN
Mol. Mass.:
29707.55
Organism:
Homo sapiens (Human)
Description:
ChEMBL_806653
Residue:
261
  
Inhibitor
Name:
BDBM50137277
Synonyms:
2-(4-Amino-benzenesulfonyl)-6-hydroxy-1,2,3,4-tetrahydro-isoquinoline-1-carboxylic acid hydroxyamide | CHEMBL148406
Type:
Small organic molecule
Emp. Form.:
C16H17N3O5S
Mol. Mass.:
363.388
SMILES:
Nc1ccc(cc1)S(=O)(=O)N1CCc2cc(O)ccc2C1C(=O)NO
: