Target
Matrix metalloproteinase-26
Ligand
BDBM50137278
Substrate
Meas. Tech.
ChEBML_104566
IC50
7903.0±n/a nM
Citation
 Ma, DWu, WYang, GLi, JLi, JYe, Q Tetrahydroisoquinoline based sulfonamide hydroxamates as potent matrix metalloproteinase inhibitors. Bioorg Med Chem Lett 14:47-50 (2003)  
Target
Name:
Matrix metalloproteinase-26
Synonyms:
Endometase MMP26 Matrilysin-2 Matrix metalloproteinase-26
Type:
PROTEIN
Mol. Mass.:
29707.55
Organism:
Homo sapiens (Human)
Description:
ChEMBL_806653
Residue:
261
  
Inhibitor
Name:
BDBM50137278
Synonyms:
2-(2,5-Dichloro-benzenesulfonyl)-6-hydroxy-1,2,3,4-tetrahydro-isoquinoline-1-carboxylic acid hydroxyamide CHEMBL424130
Type:
Small organic molecule
Emp. Form.:
C16H14Cl2N2O5S
Mol. Mass.:
417.264
SMILES:
ONC(=O)C1N(CCc2cc(O)ccc12)S(=O)(=O)c1cc(Cl)ccc1Cl
: