Target
Matrix metalloproteinase-26
Ligand
BDBM50137285
Substrate
Meas. Tech.
ChEBML_104566
IC50
2046±n/a nM
Citation
 Ma, DWu, WYang, GLi, JLi, JYe, Q Tetrahydroisoquinoline based sulfonamide hydroxamates as potent matrix metalloproteinase inhibitors. Bioorg Med Chem Lett 14:47-50 (2003)  
Target
Name:
Matrix metalloproteinase-26
Synonyms:
Endometase MMP26 Matrilysin-2 Matrix metalloproteinase-26
Type:
PROTEIN
Mol. Mass.:
29707.55
Organism:
Homo sapiens (Human)
Description:
ChEMBL_806653
Residue:
261
  
Inhibitor
Name:
BDBM50137285
Synonyms:
6-(benzyloxy)-N-hydroxy-2-tosyl-1,2,3,4-tetrahydroisoquinoline-1-carboxamide CHEMBL146718
Type:
Small organic molecule
Emp. Form.:
C24H24N2O5S
Mol. Mass.:
452.523
SMILES:
Cc1ccc(cc1)S(=O)(=O)N1CCc2cc(OCc3ccccc3)ccc2C1C(=O)NO
: