Target
Matrix metalloproteinase-26
Ligand
BDBM50137276
Substrate
Meas. Tech.
ChEBML_104566
IC50
86.0±n/a nM
Citation
 Ma, DWu, WYang, GLi, JLi, JYe, Q Tetrahydroisoquinoline based sulfonamide hydroxamates as potent matrix metalloproteinase inhibitors. Bioorg Med Chem Lett 14:47-50 (2003)  
Target
Name:
Matrix metalloproteinase-26
Synonyms:
Endometase MMP26 Matrilysin-2 Matrix metalloproteinase-26
Type:
PROTEIN
Mol. Mass.:
29707.55
Organism:
Homo sapiens (Human)
Description:
ChEMBL_806653
Residue:
261
  
Inhibitor
Name:
BDBM50137276
Synonyms:
6-Hydroxy-7-methoxy-2-(4-methoxy-benzenesulfonyl)-1,2,3,4-tetrahydro-isoquinoline-1-carboxylic acid hydroxyamide N,6-dihydroxy-7-methoxy-2-(4-methoxyphenylsulfonyl)-1,2,3,4-tetrahydroisoquinoline-1-carboxamide
Type:
Small organic molecule
Emp. Form.:
C18H20N2O7S
Mol. Mass.:
408.426
SMILES:
COc1ccc(cc1)S(=O)(=O)N1CCc2cc(O)c(OC)cc2C1C(=O)NO
: