Target
Peptide deformylase
Ligand
BDBM50137324
Substrate
Meas. Tech.
ChEBML_154314
IC50
1±n/a nM
Citation
 East, SPBeckett, RPBrookings, DCClements, JMDoel, SKeavey, KPain, GSmith, HKThomas, WThompson, AJTodd, RSWhittaker, M Peptide deformylase inhibitors with activity against respiratory tract pathogens. Bioorg Med Chem Lett 14:59-62 (2003)  
Target
Name:
Peptide deformylase
Synonyms:
3.5.1.88 BON94_18585 D9G11_25760 FORC82_p394 Polypeptide deformylase def | def_2
Type:
Mol. Mass.:
16901.39
Organism:
Escherichia coli
Description:
Residue:
150
  
Inhibitor
Name:
BDBM50137324
Synonyms:
(R)-2-Cyclopentylmethyl-N-{(S)-1-[4,5-difluoro-2-(4-hydroxy-piperidin-1-yl)-benzoyl]-2,2-dimethyl-propyl}-3-(formyl-hydroxy-amino)-propionamide | CHEMBL158092
Type:
Small organic molecule
Emp. Form.:
C27H39F2N3O5
Mol. Mass.:
523.6125
SMILES:
CC(C)(C)[C@H](NC(=O)[C@H](CC1CCCC1)CN(O)C=O)C(=O)c1cc(F)c(F)cc1N1CCC(O)CC1
: