Target
Methionine aminopeptidase 1
Ligand
BDBM50137353
Substrate
Meas. Tech.
ChEBML_105139
Ki
390000±n/a nM
Citation
 Hu, XZhu, JSrivathsan, SPei, D Peptidyl hydroxamic acids as methionine aminopeptidase inhibitors. Bioorg Med Chem Lett 14:77-9 (2003)  
Target
Name:
Methionine aminopeptidase 1
Synonyms:
Aminopeptidase MAP 1 METAP1 Methionine Aminopeptidase Type 1 (MetAP1) | Peptidase M 1
Type:
Enzyme
Mol. Mass.:
43220.79
Organism:
Homo sapiens (Human)
Description:
MetAP1 with an N-terminal six histidine tag was expressed in baculovirus infected sf9 cells.
Residue:
386
  
Inhibitor
Name:
BDBM50137353
Synonyms:
CHEMBL349154 | [((S)-2-Amino-4-methylsulfanyl-butyryl)-hydroxy-amino]-acetic acid
Type:
Small organic molecule
Emp. Form.:
C7H14N2O4S
Mol. Mass.:
222.262
SMILES:
CSCC[C@H](N)C(=O)N(O)CC(O)=O
: