Target
Methionine aminopeptidase 1
Ligand
BDBM50137354
Substrate
Meas. Tech.
ChEBML_105139
Ki
180000±n/a nM
Citation
 Hu, XZhu, JSrivathsan, SPei, D Peptidyl hydroxamic acids as methionine aminopeptidase inhibitors. Bioorg Med Chem Lett 14:77-9 (2003)  
Target
Name:
Methionine aminopeptidase 1
Synonyms:
Aminopeptidase MAP 1 METAP1 Methionine Aminopeptidase Type 1 (MetAP1) | Peptidase M 1
Type:
Enzyme
Mol. Mass.:
43220.79
Organism:
Homo sapiens (Human)
Description:
MetAP1 with an N-terminal six histidine tag was expressed in baculovirus infected sf9 cells.
Residue:
386
  
Inhibitor
Name:
BDBM50137354
Synonyms:
CHEMBL164406 | [((R)-2-Amino-propionyl)-hydroxy-amino]-acetic acid
Type:
Small organic molecule
Emp. Form.:
C5H10N2O4
Mol. Mass.:
162.1439
SMILES:
C[C@@H](N)C(=O)N(O)CC(O)=O
: