Target
Tyrosine-protein kinase Yes
Ligand
BDBM50137585
Substrate
Meas. Tech.
ChEBML_217598
IC50
160±n/a nM
Citation
 Guan, HLaird, ADBlake, RATang, CLiang, C Design and synthesis of aminopropyl tetrahydroindole-based indolin-2-ones as selective and potent inhibitors of Src and Yes tyrosine kinase. Bioorg Med Chem Lett 14:187-90 (2003)  
Target
Name:
Tyrosine-protein kinase Yes
Synonyms:
Proto-oncogene c-Yes YES YES_HUMAN | p61-yes
Type:
Protein
Mol. Mass.:
60801.54
Organism:
Homo sapiens (Human)
Description:
P07947
Residue:
543
  
Inhibitor
Name:
BDBM50137585
Synonyms:
5-Ethanesulfonyl-3-[1-(3-morpholin-4-ylmethyl-4,5,6,7-tetrahydro-1H-indol-2-yl)-meth-(Z)-ylidene]-1,3-dihydro-indol-2-one | CHEMBL55594
Type:
Small organic molecule
Emp. Form.:
C24H29N3O4S
Mol. Mass.:
455.57
SMILES:
CCS(=O)(=O)c1ccc2NC(=O)\C(=C/c3[nH]c4CCCCc4c3CN3CCOCC3)c2c1
: