Target
RAC-alpha/RAC-beta/RAC-gamma serine/threonine-protein kinase
Ligand
BDBM182517
Substrate
Meas. Tech.
ChEMBL_2116380 (CHEMBL4825321)
IC50
1.000000±n/a nM
Citation
 Xiao, YHuck, BRLan, RDeSelm, LChen, XQiu, HNeagu, CJohnson, TMochalkin, IGardberg, AJiang, XTian, HDutt, VSantos, DHead, JJackson, JSyed, SLin, JWilker, EMa, JClark, AMachl, ABankston, DJones, CCVGoutopoulos, ASherer, B Discovery of 4-aminopyrimidine analogs as highly potent dual P70S6K/Akt inhibitors. Bioorg Med Chem Lett 50:0 (2021)  
Target
Name:
RAC-alpha/RAC-beta/RAC-gamma serine/threonine-protein kinase
Synonyms:
Serine/threonine-protein kinase AKT
Type:
Mol. Mass.:
Description:
ASSAY_ID of ChEMBL is 30507
Components:
This complex has 3 components.
Component 1
Name:
RAC-beta serine/threonine-protein kinase
Synonyms:
AKT2 PKB beta Protein kinase B (Akt 2) Protein kinase B, beta RAC-alpha serine/threonine-protein kinase (AKT2) RAC-beta serine/threonine-protein kinase (AKT2) Serine/threonine-protein kinase AKT2 | Serine/threonine-protein kinase Rac alpha/beta
Type:
Enzyme
Mol. Mass.:
55766.64
Organism:
Homo sapiens (Human)
Description:
Residue:
481
  
Component 2
Name:
RAC-gamma serine/threonine-protein kinase
Synonyms:
AKT3 PKB gamma Protein kinase Akt-3 Protein kinase B, gamma RAC-gamma serine/threonine-protein kinase Serine/threonine-protein kinase AKT | Serine/threonine-protein kinase AKT3
Type:
Enzyme
Mol. Mass.:
55769.36
Organism:
Homo sapiens (Human)
Description:
Residue:
479
  
Component 3
Name:
RAC-alpha serine/threonine-protein kinase
Synonyms:
AKT phosphorylation (p-AKT) AKT1/PPP1CA C-AKT PKB alpha Protein kinase B Protein kinase B (Akt 1) Protein kinase B alpha Proto-oncogene Akt (Akt1) Proto-oncogene c-Akt (AKT1) RAC-PK-alpha RAC-alpha serine/threonine-protein kinase (AKT1) | RAC-alpha serine/threonine-protein kinase (pAKT)
Type:
Enzyme
Mol. Mass.:
55681.25
Organism:
Homo sapiens (Human)
Description:
P31749
Residue:
480
  
Inhibitor
Name:
BDBM182517
Synonyms:
US9145392, 218
Type:
Small organic molecule
Emp. Form.:
C24H26ClF4N7
Mol. Mass.:
523.957
SMILES:
Nc1ncnc(N2CCC(CC2)c2nc(cn2CCN2CCC2)-c2ccc(F)c(c2)C(F)(F)F)c1Cl
: