Target
Potassium voltage-gated channel subfamily H member 2
Ligand
BDBM182517
Substrate
Meas. Tech.
ChEMBL_2116382 (CHEMBL4825323)
IC50
1900±n/a nM
Citation
 Xiao, YHuck, BRLan, RDeSelm, LChen, XQiu, HNeagu, CJohnson, TMochalkin, IGardberg, AJiang, XTian, HDutt, VSantos, DHead, JJackson, JSyed, SLin, JWilker, EMa, JClark, AMachl, ABankston, DJones, CCVGoutopoulos, ASherer, B Discovery of 4-aminopyrimidine analogs as highly potent dual P70S6K/Akt inhibitors. Bioorg Med Chem Lett 50:0 (2021)  
Target
Name:
Potassium voltage-gated channel subfamily H member 2
Synonyms:
1,3-beta-glucan synthase component GLS2 ERG Eag-related protein 1 Ether-a-go-go-related gene (HERG) Ether-a-go-go-related gene potassium channel 1 Ether-a-go-go-related gene potassium channel 1 (hERG1) Ether-a-go-go-related protein 1 H-ERG KCNH2 Potassium voltage-gated channel subfamily H member 2 (hERG) Voltage-gated potassium channel subunit Kv11.1 hERG Potassium Channel 1 | putative potassium channel subunit
Type:
Multi-pass membrane protein
Mol. Mass.:
126672.65
Organism:
Homo sapiens (Human)
Description:
Q12809
Residue:
1159
  
Inhibitor
Name:
BDBM182517
Synonyms:
US9145392, 218
Type:
Small organic molecule
Emp. Form.:
C24H26ClF4N7
Mol. Mass.:
523.957
SMILES:
Nc1ncnc(N2CCC(CC2)c2nc(cn2CCN2CCC2)-c2ccc(F)c(c2)C(F)(F)F)c1Cl
: