Target
Polyunsaturated fatty acid lipoxygenase ALOX15B
Ligand
BDBM68853
Substrate
Meas. Tech.
ChEMBL_2116448 (CHEMBL4825389)
IC50
340±n/a nM
Citation
 Tsai, WCGilbert, NCOhler, AArmstrong, MPerry, SKalyanaraman, CYasgar, ARai, GSimeonov, AJadhav, AStandley, MLee, HWCrews, PIavarone, ATJacobson, MPNeau, DBOffenbacher, ARNewcomer, MHolman, TR Kinetic and structural investigations of novel inhibitors of human epithelial 15-lipoxygenase-2. Bioorg Med Chem 46:0 (2021)  
Target
Name:
Polyunsaturated fatty acid lipoxygenase ALOX15B
Synonyms:
15-LOX-2 15-Lipoxygenase-2 (15-LOX-2) ALOX15B Arachidonate 15-lipoxygenase, type II Epithelial 15-lipoxygenase-2 | LX15B_HUMAN
Type:
Protein
Mol. Mass.:
75850.40
Organism:
Homo sapiens (Human)
Description:
Residue:
676
  
Inhibitor
Name:
BDBM68853
Synonyms:
1-phenyl-2-[[4-(trifluoromethyl)benzyl]thio]imidazole 1-phenyl-2-[[4-(trifluoromethyl)phenyl]methylthio]imidazole MLS000327069 cid_3696046
Type:
Small organic molecule
Emp. Form.:
C17H13F3N2S
Mol. Mass.:
334.359
SMILES:
FC(F)(F)c1ccc(CSc2nccn2-c2ccccc2)cc1
: