Target
Polyunsaturated fatty acid lipoxygenase ALOX15B
Ligand
BDBM50572159
Substrate
Meas. Tech.
ChEMBL_2116449 (CHEMBL4825390)
Ki
900±n/a nM
Citation
 Tsai, WCGilbert, NCOhler, AArmstrong, MPerry, SKalyanaraman, CYasgar, ARai, GSimeonov, AJadhav, AStandley, MLee, HWCrews, PIavarone, ATJacobson, MPNeau, DBOffenbacher, ARNewcomer, MHolman, TR Kinetic and structural investigations of novel inhibitors of human epithelial 15-lipoxygenase-2. Bioorg Med Chem 46:0 (2021)  
Target
Name:
Polyunsaturated fatty acid lipoxygenase ALOX15B
Synonyms:
15-LOX-2 15-Lipoxygenase-2 (15-LOX-2) ALOX15B Arachidonate 15-lipoxygenase, type II Epithelial 15-lipoxygenase-2 | LX15B_HUMAN
Type:
Protein
Mol. Mass.:
75850.40
Organism:
Homo sapiens (Human)
Description:
Residue:
676
  
Inhibitor
Name:
BDBM50572159
Synonyms:
CHEMBL1489870
Type:
Small organic molecule
Emp. Form.:
C14H15ClN2O
Mol. Mass.:
262.735
SMILES:
Clc1ccc(cc1)-c1nnc(o1)C1CCCCC1
: