Target
Delta-type opioid receptor
Ligand
BDBM50135800
Substrate
Meas. Tech.
ChEMBL_147025 (CHEMBL753666)
Ki
1.9±n/a nM
Citation
 Zhang, AXiong, WBidlack, JMHilbert, JEKnapp, BIWentland, MPNeumeyer, JL 10-Ketomorphinan and 3-substituted-3-desoxymorphinan analogues as mixed kappa and micro opioid ligands: synthesis and biological evaluation of their binding affinity at opioid receptors. J Med Chem 47:165-74 (2003)  
Target
Name:
Delta-type opioid receptor
Synonyms:
D-OR-1 Delta opioid receptor OPIATE Delta OPRD1 OPRK1 | opioid receptor, delta 1
Type:
G Protein-Coupled Receptor (GPCR)
Mol. Mass.:
40382.98
Organism:
Homo sapiens (Human)
Description:
Competition binding assays were carried out using membrane preparations from transfected HN9.10 cells that constitutively expressed the delta opioid receptor.
Residue:
372
  
Inhibitor
Name:
BDBM50135800
Synonyms:
(-)-3-Hydroxy-N-cycloproypylmethylmorphinan Mandelate 3-Hydroxy-N-cyclopropylmethylmorphinan CYCLORPHAN US10736890, Compound TABLE B.6 US9656961, Example 00123
Type:
Small organic molecule
Emp. Form.:
C20H27NO
Mol. Mass.:
297.4345
SMILES:
Oc1ccc2C[C@@H]3[C@@H]4CCCC[C@]4(CCN3CC3CC3)c2c1
: