Target
Fusion glycoprotein F0
Ligand
BDBM50572449
Substrate
Meas. Tech.
ChEMBL_2116840 (CHEMBL4825906)
IC50
1.5±n/a nM
Citation
 Cockerill, GSAngell, RMBedernjak, AChuckowree, IFraser, IGascon-Simorte, JGilman, MSAGood, JADHarland, RJohnson, SMLudes-Meyers, JHLittler, ELumley, JLunn, GMathews, NMcLellan, JSParadowski, MPeeples, MEScott, CTait, DTaylor, GThom, MThomas, EVillalonga Barber, CWard, SEWatterson, DWilliams, GYoung, PPowell, K Discovery of Sisunatovir (RV521), an Inhibitor of Respiratory Syncytial Virus Fusion. J Med Chem 64:3658-3676 (2021)  
Target
Name:
Fusion glycoprotein F0
Synonyms:
F Fusion glycoprotein F0 Fusion glycoprotein F2 Pep27 p27
Type:
PROTEIN
Mol. Mass.:
63471.29
Organism:
Human respiratory syncytial virus A (strain A2)
Description:
ChEMBL_116942
Residue:
574
  
Inhibitor
Name:
BDBM50572449
Synonyms:
CHEMBL4853602
Type:
Small organic molecule
Emp. Form.:
C23H25FN4O2
Mol. Mass.:
408.4686
SMILES:
NCc1ccc2n(CCCCO)c(CN3C(=O)C4(CC4)c4ccc(F)cc34)nc2c1
: