Target
Fusion glycoprotein F0
Ligand
BDBM50572464
Substrate
Meas. Tech.
ChEMBL_2116908 (CHEMBL4825974)
IC50
0.900000±n/a nM
Citation
 Cockerill, GSAngell, RMBedernjak, AChuckowree, IFraser, IGascon-Simorte, JGilman, MSAGood, JADHarland, RJohnson, SMLudes-Meyers, JHLittler, ELumley, JLunn, GMathews, NMcLellan, JSParadowski, MPeeples, MEScott, CTait, DTaylor, GThom, MThomas, EVillalonga Barber, CWard, SEWatterson, DWilliams, GYoung, PPowell, K Discovery of Sisunatovir (RV521), an Inhibitor of Respiratory Syncytial Virus Fusion. J Med Chem 64:3658-3676 (2021)  
Target
Name:
Fusion glycoprotein F0
Synonyms:
F Fusion glycoprotein F0 Fusion glycoprotein F2 Pep27 p27
Type:
PROTEIN
Mol. Mass.:
63471.29
Organism:
Human respiratory syncytial virus A (strain A2)
Description:
ChEMBL_116942
Residue:
574
  
Inhibitor
Name:
BDBM50572464
Synonyms:
CHEMBL4858040
Type:
Small organic molecule
Emp. Form.:
C23H27N5O
Mol. Mass.:
389.4934
SMILES:
CC(C)CCn1c(CN2C(=O)C3(CC3)c3ccncc23)nc2cc(CN)ccc12
: