Target
ATP-dependent translocase ABCB1
Ligand
BDBM50572467
Substrate
Meas. Tech.
ChEMBL_2116924 (CHEMBL4825990)
EC50
15±n/a nM
Citation
 Smolinski, MPUrgaonkar, SPitzonka, LCutler, MLee, GSuh, KHLau, JYN Discovery of Encequidar, First-in-Class Intestine Specific P-glycoprotein Inhibitor. J Med Chem 64:3677-3693 (2021)  
Target
Name:
ATP-dependent translocase ABCB1
Synonyms:
ABCB1 MDR1_HUMAN Multidrug resistance protein 1 P-glycoprotein (P-gp) PGY1
Type:
Protein
Mol. Mass.:
141503.50
Organism:
Homo sapiens (Human)
Description:
P08183
Residue:
1280
  
Inhibitor
Name:
BDBM50572467
Synonyms:
CHEMBL4873470
Type:
Small organic molecule
Emp. Form.:
C38H37N7O5
Mol. Mass.:
671.7443
SMILES:
COc1cc2CCN(CCc3ccc(cc3)-n3nnc(n3)-c3cc(OC)c(OC)cc3NC(=O)c3cnc4ccccc4c3)Cc2cc1OC
: