Target
Calcium/calmodulin-dependent protein kinase kinase 1
Ligand
BDBM50572902
Substrate
Meas. Tech.
ChEMBL_2118551 (CHEMBL4827617)
IC50
5481±n/a nM
Citation
 Eduful, BJO'Byrne, SNTemme, LAsquith, CRMLiang, YPicado, APilotte, JRHossain, MAWells, CIZuercher, WJCatta-Preta, CMCZonzini Ramos, PSantiago, ASCouņago, RMLangendorf, CGNay, KOakhill, JSPulliam, TLLin, CAwad, DWillson, TMFrigo, DEScott, JWDrewry, DH Hinge Binder Scaffold Hopping Identifies Potent Calcium/Calmodulin-Dependent Protein Kinase Kinase 2 (CAMKK2) Inhibitor Chemotypes. J Med Chem 64:10849-10877 (2021)  
Target
Name:
Calcium/calmodulin-dependent protein kinase kinase 1
Synonyms:
CAMKK1 CaM-kinase kinase alpha | KKCC1_HUMAN
Type:
PROTEIN
Mol. Mass.:
55727.76
Organism:
Homo sapiens (Human)
Description:
ChEMBL_774623
Residue:
505
  
Inhibitor
Name:
BDBM50572902
Synonyms:
CHEMBL4878827
Type:
Small organic molecule
Emp. Form.:
C20H18N2O2
Mol. Mass.:
318.3691
SMILES:
OC(=O)c1ccc(cc1C1CCCC1)-c1ncnc2ccccc12
: