Target
2-Hydroxyacid oxidase 1
Ligand
BDBM50463046
Substrate
Meas. Tech.
ChEMBL_2118579 (CHEMBL4827645)
Ki
15±n/a nM
Citation
 Ding, JGumpena, RBoily, MOCaron, AChong, OCox, JHDumais, VGaudreault, SGraff, AHKing, AKnight, JOballa, RSurendradoss, JTang, TWu, JLowther, WTPowell, DA Dual Glycolate Oxidase/Lactate Dehydrogenase A Inhibitors for Primary Hyperoxaluria. ACS Med Chem Lett 12:1116-1123 (2021)  
Target
Name:
2-Hydroxyacid oxidase 1
Synonyms:
GOX1 HAOX1_HUMAN | Hydroxyacid oxidase 1
Type:
PROTEIN
Mol. Mass.:
40927.89
Organism:
Homo sapiens (Human)
Description:
ChEMBL_71275
Residue:
370
  
Inhibitor
Name:
BDBM50463046
Synonyms:
CHEMBL1229989
Type:
Small organic molecule
Emp. Form.:
C15H27N3O2S
Mol. Mass.:
313.459
SMILES:
CCCCCCCCCCCCSc1[nH]nnc1C(O)=O
: