Target
Metabotropic glutamate receptor 5
Ligand
BDBM50004881
Substrate
Meas. Tech.
ChEMBL_104284 (CHEMBL711719)
EC50
>500000±n/a nM
Citation
 Collado, IPedregal, CBueno, ABMarcos, AGonzález, RBlanco-Urgoiti, JPérez-Castells, JSchoepp, DDWright, RAJohnson, BGKingston, AEMoher, EDHoard, DWGriffey, KITizzano, JP (2S,1'S,2'R,3'R)-2-(2'-Carboxy-3'-hydroxymethylcyclopropyl) glycine is a highly potent group 2 and 3 metabotropic glutamate receptor agonist with oral activity. J Med Chem 47:456-66 (2004)  
Target
Name:
Metabotropic glutamate receptor 5
Synonyms:
GRM5_RAT Grm5 Mglur5 metabotropic glutamate 5/1-C metabotropic glutamate 5a
Type:
Enzyme
Mol. Mass.:
131900.14
Organism:
Rattus norvegicus (Rat)
Description:
P31424
Residue:
1203
  
Inhibitor
Name:
BDBM50004881
Synonyms:
(RS) PPG Amino-(4-phosphono-phenyl)-acetic acid(RS-PPG) PPG
Type:
Small organic molecule
Emp. Form.:
C8H10NO5P
Mol. Mass.:
231.1425
SMILES:
NC(C(O)=O)c1ccc(cc1)P(O)(O)=O
: