Target
Metabotropic glutamate receptor 1
Ligand
BDBM50138783
Substrate
Meas. Tech.
ChEMBL_105721 (CHEMBL719088)
EC50
32000±n/a nM
Citation
 Collado, IPedregal, CBueno, ABMarcos, AGonzález, RBlanco-Urgoiti, JPérez-Castells, JSchoepp, DDWright, RAJohnson, BGKingston, AEMoher, EDHoard, DWGriffey, KITizzano, JP (2S,1'S,2'R,3'R)-2-(2'-Carboxy-3'-hydroxymethylcyclopropyl) glycine is a highly potent group 2 and 3 metabotropic glutamate receptor agonist with oral activity. J Med Chem 47:456-66 (2004)  
Target
Name:
Metabotropic glutamate receptor 1
Synonyms:
GRM1_RAT Grm1 Metabotropic glutamate receptor Mglur1 metabotropic glutamate 1/5-D metabotropic glutamate receptor 1 isoform alpha precursor
Type:
Enzyme Catalytic Domain
Mol. Mass.:
133240.47
Organism:
RAT
Description:
metabotropic glutamate 1/2 0 RAT::P23385
Residue:
1199
  
Inhibitor
Name:
BDBM50138783
Synonyms:
4-((S)-Amino-carboxy-methyl)-phthalic acid CHEMBL143210
Type:
Small organic molecule
Emp. Form.:
C10H9NO6
Mol. Mass.:
239.1816
SMILES:
N[C@H](C(O)=O)c1ccc(C(O)=O)c(c1)C(O)=O
: