Target
Bifunctional dihydrofolate reductase-thymidylate synthase
Ligand
BDBM50138951
Substrate
Meas. Tech.
ChEMBL_55397 (CHEMBL667200)
Ki
2.1±n/a nM
Citation
 Kamchonwongpaisan, SQuarrell, RCharoensetakul, NPonsinet, RVilaivan, TVanichtanankul, JTarnchompoo, BSirawaraporn, WLowe, GYuthavong, Y Inhibitors of multiple mutants of Plasmodium falciparum dihydrofolate reductase and their antimalarial activities. J Med Chem 47:673-80 (2004)  
Target
Name:
Bifunctional dihydrofolate reductase-thymidylate synthase
Synonyms:
DHFR-TS Dihydrofolate Reductase-Thymidylate Synthase (DHFR-TS) Mutant KICB1 PfDHFR-TS double mutant (C59R+S108N)
Type:
Enzyme
Mol. Mass.:
71822.51
Organism:
Plasmodium falciparum (isolate K1 / Thailand)
Description:
The mutant clone was prepared by cassette mutagenesis using wildtype pfDHFR as a template, and expressed in E. coli.
Residue:
608
  
Inhibitor
Name:
BDBM50138951
Synonyms:
1-(3-Chloro-phenyl)-6-(4-propoxy-phenyl)-1,6-dihydro-[1,3,5]triazine-2,4-diamine CHEMBL346982
Type:
Small organic molecule
Emp. Form.:
C18H20ClN5O
Mol. Mass.:
357.837
SMILES:
CCCOc1ccc(cc1)C1N=C(N)N=C(N)N1c1cccc(Cl)c1
: