Target
Indoleamine 2,3-dioxygenase 1
Ligand
BDBM50573448
Substrate
Meas. Tech.
ChEMBL_2119554 (CHEMBL4828620)
IC50
0.692800±n/a nM
Citation
 Sabnis, RW Novel Substituted Tetrahydroquinoline Compounds as Indoleamine-2,3-dioxygenase (IDO) Inhibitors. ACS Med Chem Lett 12:1524-1525 (2021)  
Target
Name:
Indoleamine 2,3-dioxygenase 1
Synonyms:
I23O1_HUMAN IDO-1 INDO Indoleamine 2,3-dioxygenase | Indoleamine-pyrrole 2,3-dioxygenase
Type:
Enzyme
Mol. Mass.:
45330.80
Organism:
Homo sapiens (Human)
Description:
P14902
Residue:
403
  
Inhibitor
Name:
BDBM50573448
Synonyms:
CHEMBL4862659
Type:
Small organic molecule
Emp. Form.:
C23H23ClN4O2
Mol. Mass.:
422.907
SMILES:
Clc1ccc2nc([nH]c2c1)C1(CCC1)c1ccc2N(CCCc2n1)C(=O)OC1CC1
: