Target
Indoleamine 2,3-dioxygenase 1
Ligand
BDBM50573449
Substrate
Meas. Tech.
ChEMBL_2119554 (CHEMBL4828620)
IC50
0.958300±n/a nM
Citation
 Sabnis, RW Novel Substituted Tetrahydroquinoline Compounds as Indoleamine-2,3-dioxygenase (IDO) Inhibitors. ACS Med Chem Lett 12:1524-1525 (2021)  
Target
Name:
Indoleamine 2,3-dioxygenase 1
Synonyms:
I23O1_HUMAN IDO-1 INDO Indoleamine 2,3-dioxygenase | Indoleamine-pyrrole 2,3-dioxygenase
Type:
Enzyme
Mol. Mass.:
45330.80
Organism:
Homo sapiens (Human)
Description:
P14902
Residue:
403
  
Inhibitor
Name:
BDBM50573449
Synonyms:
CHEMBL4848644
Type:
Small organic molecule
Emp. Form.:
C26H21ClF3N5O
Mol. Mass.:
511.926
SMILES:
FC(F)(F)c1cnc2nc([nH]c2c1)C1(CCC1)c1ccc2N(CCCc2n1)C(=O)c1ccccc1Cl
: