Target
Cathepsin K
Ligand
BDBM50139496
Substrate
Meas. Tech.
ChEBML_45550
IC50
1.1±n/a nM
Citation
 Catalano, JGDeaton, DNLong, STMcFadyen, RBMiller, LRPayne, JAWells-Knecht, KJWright, LL Design of small molecule ketoamide-based inhibitors of cathepsin K. Bioorg Med Chem Lett 14:719-22 (2004)  
Target
Name:
Cathepsin K
Synonyms:
CATK_HUMAN CTSO Cathepsin O Cathepsin X
Type:
Enzyme
Mol. Mass.:
36975.68
Organism:
Homo sapiens (Human)
Description:
P43235
Residue:
329
  
Inhibitor
Name:
BDBM50139496
Synonyms:
(R)-4,4-dimethyl-1-phenylpentan-3-yl(S)-1,2-dioxo-1-((R)-1-phenylethylamino)heptan-3-ylcarbamate [(S)-1-((R)-1-Phenyl-ethylaminooxalyl)-pentyl]-carbamic acid (R)-2,2-dimethyl-1-phenethyl-propyl ester
Type:
Small organic molecule
Emp. Form.:
C29H40N2O4
Mol. Mass.:
480.6389
SMILES:
CCCC[C@H](NC(=O)O[C@H](CCc1ccccc1)C(C)(C)C)C(=O)C(=O)N[C@H](C)c1ccccc1
: