Target
Ribosomal protein S6 kinase alpha-2
Ligand
BDBM50425829
Substrate
Meas. Tech.
ChEMBL_2122067 (CHEMBL4831214)
Kd
1300±n/a nM
Citation
 Russ, NSchröder, MBerger, BTMandel, SAydogan, YMauer, SPohl, CDrewry, DHChaikuad, AMüller, SKnapp, S Design and Development of a Chemical Probe for Pseudokinase Ca J Med Chem 64:14358-14376 (2021)  
Target
Name:
Ribosomal protein S6 kinase alpha-2
Synonyms:
90 kDa ribosomal protein S6 kinase 2 KS6A2_HUMAN MAPKAPK1C RPS6KA2(Kin.Dom.1 - N-terminal) Ribosomal S6 Kinase 3 (RSK-3) Ribosomal protein S6 kinase alpha 2 (RSK2) p90-RSK 2 pp90RSK3
Type:
Serine/threonine-protein kinase
Mol. Mass.:
83259.46
Organism:
Homo sapiens (Human)
Description:
Residue:
733
  
Inhibitor
Name:
BDBM50425829
Synonyms:
CHEMBL2312304
Type:
Small organic molecule
Emp. Form.:
C23H28Cl2N6O3
Mol. Mass.:
507.413
SMILES:
Clc1ccc(Cl)c(CNc2ncc(C(=O)NCCCN3CCOC3=O)c(NC3CCCC3)n2)c1
: