Target
Galectin-7
Ligand
BDBM50574701
Substrate
Meas. Tech.
ChEMBL_2123012 (CHEMBL4832245)
Kd
190000±n/a nM
Citation
 Hassan, Mvan Klaveren, SHåkansson, MDiehl, CKova?i?, RBaussière, FSundin, APDernov?ek, JWalse, BZetterberg, FLeffler, HAnderluh, MToma?i?, TJakopin, ?Nilsson, UJ Benzimidazole-galactosides bind selectively to the Galectin-8 N-Terminal domain: Structure-based design and optimisation. Eur J Med Chem 223:0 (2021)  
Target
Name:
Galectin-7
Synonyms:
Gal-7 LEG7_HUMAN PI7 p53-induced gene 1 protein
Type:
Galactoside-binding protein
Mol. Mass.:
15077.89
Organism:
Homo sapiens (Human)
Description:
Residue:
136
  
Inhibitor
Name:
BDBM50574701
Synonyms:
CHEMBL4858277
Type:
Small organic molecule
Emp. Form.:
C22H22Cl2N2O7S
Mol. Mass.:
529.39
SMILES:
Cn1c(CO[C@H]2[C@@H](O)[C@@H](CO)O[C@H](Sc3ccc(Cl)c(Cl)c3)[C@@H]2O)nc2ccc(cc12)C(O)=O
: