Target
C-X-C chemokine receptor type 1
Ligand
BDBM50140794
Substrate
Meas. Tech.
ChEMBL_44673 (CHEMBL656546)
IC50
18200±n/a nM
Citation
 Widdowson, KLElliott, JDVeber, DFNie, HRutledge, MCMcCleland, BWXiang, JNJurewicz, AJHertzberg, RPFoley, JJGriswold, DEMartin, LLee, JMWhite, JRSarau, HM Evaluation of potent and selective small-molecule antagonists for the CXCR2 chemokine receptor. J Med Chem 47:1319-21 (2004)  
Target
Name:
C-X-C chemokine receptor type 1
Synonyms:
C-X-C chemokine receptor type 1 (CXCR-1) CMKAR1 CXCR1_HUMAN Interleukin-8 receptor A | Interleukin-8 receptors, CXCR1/CXCR2
Type:
Enzyme
Mol. Mass.:
39803.83
Organism:
Homo sapiens (Human)
Description:
P25024
Residue:
350
  
Inhibitor
Name:
BDBM50140794
Synonyms:
1-(2-Hydroxy-4-nitro-phenyl)-3-phenyl-urea CHEMBL280711
Type:
Small organic molecule
Emp. Form.:
C13H11N3O4
Mol. Mass.:
273.2441
SMILES:
Oc1cc(ccc1NC(=O)Nc1ccccc1)[N+]([O-])=O
: