Target
Cysteine protease
Ligand
BDBM50574836
Substrate
Meas. Tech.
ChEMBL_2123441 (CHEMBL4832674)
Ki
0.450000±n/a nM
Citation
 Jung, SFuchs, NJohe, PWagner, ADiehl, EYuliani, TZimmer, CBarthels, FZimmermann, RAKlein, PWaigel, WMeyr, JOpatz, TTenzer, SDistler, URäder, HJKersten, CEngels, BHellmich, UAKlein, JSchirmeister, T Fluorovinylsulfones and -Sulfonates as Potent Covalent Reversible Inhibitors of the Trypanosomal Cysteine Protease Rhodesain: Structure-Activity Relationship, Inhibition Mechanism, Metabolism, and In Vivo Studies. J Med Chem 64:12322-12358 (2021)  
Target
Name:
Cysteine protease
Synonyms:
Rhodesain
Type:
PROTEIN
Mol. Mass.:
48425.78
Organism:
Trypanosoma brucei rhodesiense
Description:
ChEMBL_619861
Residue:
450
  
Inhibitor
Name:
BDBM50574836
Synonyms:
CHEMBL4871105
Type:
Small organic molecule
Emp. Form.:
C33H33N3O5S
Mol. Mass.:
583.697
SMILES:
Cc1ccc(C[C@H](NC(=O)c2ccncc2)C(=O)N[C@@H](CCc2ccccc2)\C=C\S(=O)(=O)Oc2ccccc2)cc1
: