Target
Cysteine protease
Ligand
BDBM50574817
Substrate
Meas. Tech.
ChEMBL_2123442 (CHEMBL4832675)
Ki
9.0±n/a nM
Citation
 Jung, SFuchs, NJohe, PWagner, ADiehl, EYuliani, TZimmer, CBarthels, FZimmermann, RAKlein, PWaigel, WMeyr, JOpatz, TTenzer, SDistler, URäder, HJKersten, CEngels, BHellmich, UAKlein, JSchirmeister, T Fluorovinylsulfones and -Sulfonates as Potent Covalent Reversible Inhibitors of the Trypanosomal Cysteine Protease Rhodesain: Structure-Activity Relationship, Inhibition Mechanism, Metabolism, and In Vivo Studies. J Med Chem 64:12322-12358 (2021)  
Target
Name:
Cysteine protease
Synonyms:
Rhodesain
Type:
PROTEIN
Mol. Mass.:
48425.78
Organism:
Trypanosoma brucei rhodesiense
Description:
ChEMBL_619861
Residue:
450
  
Inhibitor
Name:
BDBM50574817
Synonyms:
CHEMBL4855613
Type:
Small organic molecule
Emp. Form.:
C35H33FN2O7S
Mol. Mass.:
644.709
SMILES:
F\C(=C/[C@H](CCc1ccccc1)NC(=O)[C@H](Cc1ccccc1)NC(=O)c1ccc2OCCOc2c1)S(=O)(=O)Oc1ccccc1
: