Target
Cysteine protease
Ligand
BDBM50574820
Substrate
Meas. Tech.
ChEMBL_2123442 (CHEMBL4832675)
Ki
5.0±n/a nM
Citation
 Jung, SFuchs, NJohe, PWagner, ADiehl, EYuliani, TZimmer, CBarthels, FZimmermann, RAKlein, PWaigel, WMeyr, JOpatz, TTenzer, SDistler, URäder, HJKersten, CEngels, BHellmich, UAKlein, JSchirmeister, T Fluorovinylsulfones and -Sulfonates as Potent Covalent Reversible Inhibitors of the Trypanosomal Cysteine Protease Rhodesain: Structure-Activity Relationship, Inhibition Mechanism, Metabolism, and In Vivo Studies. J Med Chem 64:12322-12358 (2021)  
Target
Name:
Cysteine protease
Synonyms:
Rhodesain
Type:
PROTEIN
Mol. Mass.:
48425.78
Organism:
Trypanosoma brucei rhodesiense
Description:
ChEMBL_619861
Residue:
450
  
Inhibitor
Name:
BDBM50574820
Synonyms:
CHEMBL4863808
Type:
Small organic molecule
Emp. Form.:
C34H31F3N2O5S
Mol. Mass.:
636.681
SMILES:
Cc1ccc(C[C@H](NC(=O)c2cc(F)cc(F)c2)C(=O)N[C@@H](CCc2ccccc2)\C=C(/F)S(=O)(=O)Oc2ccccc2)cc1
: