Target
Nitric oxide synthase, inducible
Ligand
BDBM50141076
Substrate
Meas. Tech.
ChEMBL_89188 (CHEMBL700506)
IC50
1767±n/a nM
Citation
 Lowe, JAQian, WDrozda, SEVolkmann, RANason, DNelson, RBNolan, CListon, DWard, KFaraci, SVerdries, KSeymour, PMajchrzak, MVillalobos, AWhite, WF Structure-activity relationships of potent, selective inhibitors of neuronal nitric oxide synthase based on the 6-phenyl-2-aminopyridine structure. J Med Chem 47:1575-86 (2004)  
Target
Name:
Nitric oxide synthase, inducible
Synonyms:
HEP-NOS Inducible NO synthase NOS type II NOS2A Nitric oxide synthase, inducible (iNOS) | iNOS
Type:
Homodimer
Mol. Mass.:
131141.95
Organism:
Homo sapiens (Human)
Description:
P35228
Residue:
1153
  
Inhibitor
Name:
BDBM50141076
Synonyms:
6-[4-(2-Pyrrolidin-1-yl-ethoxy)-naphthalen-1-yl]-pyridin-2-ylamine | CHEMBL38845
Type:
Small organic molecule
Emp. Form.:
C21H23N3O
Mol. Mass.:
333.4268
SMILES:
Nc1cccc(n1)-c1ccc(OCCN2CCCC2)c2ccccc12
: