Target
Indoleamine 2,3-dioxygenase 1
Ligand
BDBM50391363
Substrate
Meas. Tech.
ChEMBL_2125215 (CHEMBL4834560)
IC50
34±n/a nM
Citation
 Röhrig, UFMajjigapu, SRReynaud, APojer, FDilek, NReichenbach, PAscencao, KIrving, MCoukos, GVogel, PMichielin, OZoete, V Azole-Based Indoleamine 2,3-Dioxygenase 1 (IDO1) Inhibitors. J Med Chem 64:2205-2227 (2021)  
Target
Name:
Indoleamine 2,3-dioxygenase 1
Synonyms:
I23O1_HUMAN IDO-1 INDO Indoleamine 2,3-dioxygenase | Indoleamine-pyrrole 2,3-dioxygenase
Type:
Enzyme
Mol. Mass.:
45330.80
Organism:
Homo sapiens (Human)
Description:
P14902
Residue:
403
  
Inhibitor
Name:
BDBM50391363
Synonyms:
CHEMBL2148074
Type:
Small organic molecule
Emp. Form.:
C8H6ClN3O
Mol. Mass.:
195.606
SMILES:
Oc1ccc(Cl)cc1-c1c[nH]nn1
: