Target
Bromodomain testis-specific protein
Ligand
BDBM50575644
Substrate
Meas. Tech.
ChEMBL_2125762 (CHEMBL4835107)
IC50
50±n/a nM
Citation
 Aylott, HEAtkinson, SJBamborough, PBassil, AChung, CWGordon, LGrandi, PGray, JRJHarrison, LAHayhow, TGMessenger, CMitchell, DPhillipou, APreston, APrinjha, RKRianjongdee, FRioja, ISeal, JTWall, IDWatson, RJWoolven, JMDemont, EH Template-Hopping Approach Leads to Potent, Selective, and Highly Soluble Bromo and Extraterminal Domain (BET) Second Bromodomain (BD2) Inhibitors. J Med Chem 64:3249-3281 (2021)  
Target
Name:
Bromodomain testis-specific protein
Synonyms:
BRDT Bromodomain and extra-terminal motif (BET) Cancer/testis antigen 9 | RING3-like protein
Type:
PROTEIN
Mol. Mass.:
107982.01
Organism:
Homo sapiens (Human)
Description:
ChEMBL_1502985
Residue:
947
  
Inhibitor
Name:
BDBM50575644
Synonyms:
CHEMBL4856853
Type:
Small organic molecule
Emp. Form.:
C20H20N6O
Mol. Mass.:
360.4124
SMILES:
CCNC(=O)c1cc(Cc2cccc3[nH]ccc23)nc(c1)-c1cn(C)nn1
: