Target
Melatonin receptor type 1A
Ligand
BDBM50118470
Substrate
Meas. Tech.
ChEMBL_2125811 (CHEMBL4835156)
Ki
0.014000±n/a nM
Citation
 Hoashi, YTakai, TKosugi, YNakashima, MNakayama, MHirai, KUchikawa, OKoike, T Discovery of a Potent and Orally Bioavailable Melatonin Receptor Agonist. J Med Chem 64:3059-3074 (2021)  
Target
Name:
Melatonin receptor type 1A
Synonyms:
MTNR1A MTR1A_HUMAN Mel1a melatonin receptor Melatonin receptor Melatonin receptor type 1 (MT1) | Melatonin receptor type 1A
Type:
Enzyme
Mol. Mass.:
39392.94
Organism:
Homo sapiens (Human)
Description:
P48039
Residue:
350
  
Inhibitor
Name:
BDBM50118470
Synonyms:
CHEMBL1218 RAMELTEON | Rozerem
Type:
Small organic molecule
Emp. Form.:
C16H21NO2
Mol. Mass.:
259.3434
SMILES:
CCC(=O)NCC[C@@H]1CCc2ccc3OCCc3c12
: