Target
Tyrosine-protein phosphatase non-receptor type 1
Ligand
BDBM13815
Substrate
Meas. Tech.
ChEMBL_162582 (CHEMBL768523)
IC50
460±n/a nM
Citation
 Lau, CKBayly, CIGauthier, JYLi, CSTherien, MAsante-Appiah, ECromlish, WBoie, YForghani, FDesmarais, SWang, QSkorey, KWaddleton, DPayette, PRamachandran, CKennedy, BPScapin, G Structure based design of a series of potent and selective non peptidic PTP-1B inhibitors. Bioorg Med Chem Lett 14:1043-8 (2004)  
Target
Name:
Tyrosine-protein phosphatase non-receptor type 1
Synonyms:
PTN1_HUMAN PTPN1 Protein tyrosine phosphatase-1B (PTP1B) Protein-tyrosine phosphatase 1B (PTP1B) Tyrosine-protein phosphatase non-receptor type 1 (PTP1B)
Type:
Protein phosphatase
Mol. Mass.:
49963.76
Organism:
Homo sapiens (Human)
Description:
Human recombinant GST-fusion PTP1B (1-435).
Residue:
435
  
Inhibitor
Name:
BDBM13815
Synonyms:
({4-[(4E)-2-(1H-1,2,3-benzotriazol-1-yl)-2,5-diphenylpent-4-en-1-yl]phenyl}difluoromethyl)phosphonic acid benzotriazole phenyldifluoromethylphosphonic acid compound 2
Type:
Small organic molecule
Emp. Form.:
C30H26F2N3O3P
Mol. Mass.:
545.5163
SMILES:
OP(O)(=O)C(F)(F)c1ccc(CC(C\C=C\c2ccccc2)(c2ccccc2)n2nnc3ccccc23)cc1
: